Reaction Details
TargetCannabinoid receptor 1
LigandBDBM50389939
Substrate/Competitorn/a
Meas. Tech.ChEMBL_1502797 (CHEMBL3591200)
EC50 640±n/a nM
Citation Cawston, EEConnor, MDi Marzo, VSilvestri, RGlass, M Distinct Temporal Fingerprint for Cyclic Adenosine Monophosphate (cAMP) Signaling of Indole-2-carboxamides as Allosteric Modulators of the Cannabinoid Receptors. J Med Chem58:5979-88 (2015) 
 
Cannabinoid receptor 1
Name:Cannabinoid receptor 1
Type:G Protein-Coupled Receptor (GPCR)
Mol. Mass.:52868.96
Organism:Homo sapiens (Human)
Description:P21554
Residue:472
BDBM50389939
NameBDBM50389939
Synonyms:CHEMBL1553629
TypeSmall organic molecule
Emp. Form.C24H28ClN3O
Mol. Mass.409.952
SMILESCCc1c([nH]c2ccc(Cl)cc12)C(=O)NCCc1ccc(cc1)N1CCCCC1