Reaction Details
TargetCarbonic anhydrase 1
LigandBDBM50096129
Substrate/Competitorn/a
Meas. Tech.ChEMBL_1505685 (CHEMBL3594605)
Ki>50000±n/a nM
Citation Cvijetic, INTanç, MJuranic, IOVerbic, T?Supuran, CTDrakulic, BJ 5-Aryl-1H-pyrazole-3-carboxylic acids as selective inhibitors of human carbonic anhydrases IX and XII. Bioorg Med Chem23:4649-59 (2015) 
 
Carbonic anhydrase 1
Name:Carbonic anhydrase 1
Type:Enzyme
Mol. Mass.:28873.37
Organism:Homo sapiens (Human)
Description:P00915
Residue:261
BDBM50096129
NameBDBM50096129
Synonyms:CHEMBL3593800
TypeSmall organic molecule
Emp. Form.C11H10N2O3
Mol. Mass.218.2087
SMILESCOc1ccccc1-c1cc(n[nH]1)C(O)=O