Reaction Details
TargetCarbonic anhydrase 2
LigandBDBM45862
Substrate/Competitorn/a
Meas. Tech.ChEMBL_1505686 (CHEMBL3594606)
Ki>50000±n/a nM
Citation Cvijetic, INTanç, MJuranic, IOVerbic, T?Supuran, CTDrakulic, BJ 5-Aryl-1H-pyrazole-3-carboxylic acids as selective inhibitors of human carbonic anhydrases IX and XII. Bioorg Med Chem23:4649-59 (2015) 
 
Carbonic anhydrase 2
Name:Carbonic anhydrase 2
Type:Enzyme
Mol. Mass.:29250.71
Organism:Homo sapiens (Human)
Description:P00918
Residue:260
BDBM45862
NameBDBM45862
Synonyms:5-(4-ketocyclohexa-2,5-dien-1-ylidene)-3-pyrazoline-3-carboxylic acid 5-(4-oxo-1-cyclohexa-2,5-dienylidene)-1,2-dihydropyrazole-3-carboxylic acid MLS-0111633.0001 | cid_8022834
TypeSmall organic molecule
Emp. Form.C10H8N2O3
Mol. Mass.204.1821
SMILESOC(=O)c1cc(n[nH]1)-c1ccc(O)cc1