Reaction Details
TargetCarbonic anhydrase 2
LigandBDBM50096129
Substrate/Competitorn/a
Meas. Tech.ChEMBL_1505686 (CHEMBL3594606)
Ki>50000±n/a nM
Citation Cvijetic, INTanç, MJuranic, IOVerbic, T?Supuran, CTDrakulic, BJ 5-Aryl-1H-pyrazole-3-carboxylic acids as selective inhibitors of human carbonic anhydrases IX and XII. Bioorg Med Chem23:4649-59 (2015) 
 
Carbonic anhydrase 2
Name:Carbonic anhydrase 2
Type:Enzyme
Mol. Mass.:29250.71
Organism:Homo sapiens (Human)
Description:P00918
Residue:260
BDBM50096129
NameBDBM50096129
Synonyms:CHEMBL3593800
TypeSmall organic molecule
Emp. Form.C11H10N2O3
Mol. Mass.218.2087
SMILESCOc1ccccc1-c1cc(n[nH]1)C(O)=O