Reaction Details
TargetCarbonic anhydrase 12
LigandBDBM45835
Substrate/Competitorn/a
Meas. Tech.ChEMBL_1505688 (CHEMBL3594608)
Ki 4500±n/a nM
Citation Cvijetic, INTanç, MJuranic, IOVerbic, T?Supuran, CTDrakulic, BJ 5-Aryl-1H-pyrazole-3-carboxylic acids as selective inhibitors of human carbonic anhydrases IX and XII. Bioorg Med Chem23:4649-59 (2015) 
 
Carbonic anhydrase 12
Name:Carbonic anhydrase 12
Type:Enzyme
Mol. Mass.:39456.00
Organism:Homo sapiens (Human)
Description:Catalytic domain of human cloned isozyme was used in the assay
Residue:354
BDBM45835
NameBDBM45835
Synonyms:3-(4-ethylphenyl)-1H-pyrazole-5-carboxylic acid cid_3524248
TypeSmall organic molecule
Emp. Form.C12H12N2O2
Mol. Mass.216.2359
SMILESCCc1ccc(cc1)-c1cc([nH]n1)C(O)=O