Reaction Details
TargetCarbonic anhydrase 12
LigandBDBM50096126
Substrate/Competitorn/a
Meas. Tech.ChEMBL_1505688 (CHEMBL3594608)
Ki 5500±n/a nM
Citation Cvijetic, INTanç, MJuranic, IOVerbic, T?Supuran, CTDrakulic, BJ 5-Aryl-1H-pyrazole-3-carboxylic acids as selective inhibitors of human carbonic anhydrases IX and XII. Bioorg Med Chem23:4649-59 (2015) 
 
Carbonic anhydrase 12
Name:Carbonic anhydrase 12
Type:Enzyme
Mol. Mass.:39456.00
Organism:Homo sapiens (Human)
Description:Catalytic domain of human cloned isozyme was used in the assay
Residue:354
BDBM50096126
NameBDBM50096126
Synonyms:CHEMBL3593604
TypeSmall organic molecule
Emp. Form.C14H16N2O2
Mol. Mass.244.289
SMILESCCCCc1ccc(cc1)-c1cc(n[nH]1)C(O)=O