Reaction Details
TargetCarbonic anhydrase 12
LigandBDBM50096136
Substrate/Competitorn/a
Meas. Tech.ChEMBL_1505688 (CHEMBL3594608)
Ki 39000±n/a nM
Citation Cvijetic, INTanç, MJuranic, IOVerbic, T?Supuran, CTDrakulic, BJ 5-Aryl-1H-pyrazole-3-carboxylic acids as selective inhibitors of human carbonic anhydrases IX and XII. Bioorg Med Chem23:4649-59 (2015) 
 
Carbonic anhydrase 12
Name:Carbonic anhydrase 12
Type:Enzyme
Mol. Mass.:39456.00
Organism:Homo sapiens (Human)
Description:Catalytic domain of human cloned isozyme was used in the assay
Residue:354
BDBM50096136
NameBDBM50096136
Synonyms:CHEMBL3593610
TypeSmall organic molecule
Emp. Form.C19H26N2O2
Mol. Mass.314.4219
SMILESCC(C)c1cc(C(C)C)c(-c2cc(n[nH]2)C(O)=O)c(c1)C(C)C