Reaction Details
TargetAlkaline phosphatase, placental type
LigandBDBM50080274
Substrate/Competitorn/a
Meas. Tech.ChEMBL_1506090 (CHEMBL3595956)
Ki 580000±n/a nM
Citation Fonseca, EMTrivella, DBScorsato, VDias, MPBazzo, NLMandapati, KRde Oliveira, FLFerreira-Halder, CVPilli, RAMiranda, PCAparicio, R Crystal structures of the apo form and a complex of human LMW-PTP with a phosphonic acid provide new evidence of a secondary site potentially related to the anchorage of natural substrates. Bioorg Med Chem23:4462-71 (2015) 
 
Alkaline phosphatase, placental type
Name:Alkaline phosphatase, placental type
Type:PROTEIN
Mol. Mass.:57950.65
Organism:Homo sapiens (Human)
Description:ChEMBL_1506090
Residue:535
BDBM50080274
NameBDBM50080274
Synonyms:Benzyl-phosphonic acid Phenyl-methanephosphonic acid anion | benzylphosphonic acid
TypeSmall organic molecule
Emp. Form.C7H9O3P
Mol. Mass.172.1183
SMILESOP(O)(=O)Cc1ccccc1