Reaction Details
TargetProstaglandin E synthase
LigandBDBM50227631
Substrate/Competitorn/a
Meas. Tech.ChEMBL_1495512 (CHEMBL3579896)
IC50 1590±n/a nM
Citation Luz, JGAntonysamy, SKuklish, SLCondon, BLee, MRAllison, DYu, XPChandrasekhar, SBacker, RZhang, ARussell, MChang, SSHarvey, ASloan, AVFisher, MJ Crystal Structures of mPGES-1 Inhibitor Complexes Form a Basis for the Rational Design of Potent Analgesic and Anti-Inflammatory Therapeutics. J Med Chem58:4727-37 (2015) 
 
Prostaglandin E synthase
Name:Prostaglandin E synthase
Type:Protein
Mol. Mass.:17112.22
Organism:Homo sapiens (Human)
Description:n/a
Residue:152
BDBM50227631
NameBDBM50227631
Synonyms:2-(6-chloro-1H-phenanthro[9,10-d]imidazol-2-yl)isophthalonitrile | CHEMBL412099
TypeSmall organic molecule
Emp. Form.C23H11ClN4
Mol. Mass.378.813
SMILESClc1ccc2c3[nH]c(nc3c3ccccc3c2c1)-c1c(cccc1C#N)C#N