Reaction Details
TargetProstaglandin E synthase
LigandBDBM50168766
Substrate/Competitorn/a
Meas. Tech.ChEMBL_1495511 (CHEMBL3579895)
IC50 23±n/a nM
Citation Luz, JGAntonysamy, SKuklish, SLCondon, BLee, MRAllison, DYu, XPChandrasekhar, SBacker, RZhang, ARussell, MChang, SSHarvey, ASloan, AVFisher, MJ Crystal Structures of mPGES-1 Inhibitor Complexes Form a Basis for the Rational Design of Potent Analgesic and Anti-Inflammatory Therapeutics. J Med Chem58:4727-37 (2015) 
 
Prostaglandin E synthase
Name:Prostaglandin E synthase
Type:Protein
Mol. Mass.:17112.22
Organism:Homo sapiens (Human)
Description:n/a
Residue:152
BDBM50168766
NameBDBM50168766
Synonyms:3-(1-(4-chlorobenzyl)-5-(2-fluoro-2'-methylbiphenyl-4-yl)-3-methyl-1H-indol-2-yl)-2,2-dimethylpropanoic acid CHEMBL180650
TypeSmall organic molecule
Emp. Form.C34H31ClFNO2
Mol. Mass.540.067
SMILESCc1c(CC(C)(C)C(O)=O)n(Cc2ccc(Cl)cc2)c2ccc(cc12)-c1ccc(c(F)c1)-c1ccccc1C