Reaction Details
TargetBeta sliding clamp
LigandBDBM50096611
Substrate/Competitorn/a
Meas. Tech.ChEMBL_1495912 (CHEMBL3579723)
IC50 64000±n/a nM
Citation Yin, ZWhittell, LRWang, YJergic, SMa, CLewis, PJDixon, NEBeck, JLKelso, MJOakley, AJ Bacterial Sliding Clamp Inhibitors that Mimic the Sequential Binding Mechanism of Endogenous Linear Motifs. J Med Chem58:4693-702 (2015) 
 
Beta sliding clamp
Name:Beta sliding clamp
Type:PROTEIN
Mol. Mass.:40578.60
Organism:Escherichia coli (strain K12)
Description:ChEMBL_109765
Residue:366
BDBM50096611
NameBDBM50096611
Synonyms:CHEMBL3577285
TypeSmall organic molecule
Emp. Form.C23H22BrN3O4
Mol. Mass.484.342
SMILESNC(=O)c1ccc(CNC(=O)Cn2c3C[C@@H](CCc3c3cc(Br)ccc23)C(O)=O)cc1