Reaction Details
TargetBeta sliding clamp
LigandBDBM50096634
Substrate/Competitorn/a
Meas. Tech.ChEMBL_1495912 (CHEMBL3579723)
Ki 87000±n/a nM
Citation Yin, ZWhittell, LRWang, YJergic, SMa, CLewis, PJDixon, NEBeck, JLKelso, MJOakley, AJ Bacterial Sliding Clamp Inhibitors that Mimic the Sequential Binding Mechanism of Endogenous Linear Motifs. J Med Chem58:4693-702 (2015) 
 
Beta sliding clamp
Name:Beta sliding clamp
Type:PROTEIN
Mol. Mass.:40578.60
Organism:Escherichia coli (strain K12)
Description:ChEMBL_109765
Residue:366
BDBM50096634
NameBDBM50096634
Synonyms:CHEMBL3577272
TypeSmall organic molecule
Emp. Form.C13H12BrNO2
Mol. Mass.294.144
SMILESOC(=O)[C@@H]1CCc2c(C1)[nH]c1ccc(Br)cc21