Reaction Details
TargetMelatonin receptor type 1A
LigandBDBM50097065
Substrate/Competitorn/a
Meas. Tech.ChEMBL_1499384 (CHEMBL3583713)
Ki>1000±n/a nM
Citation de la Fuente Revenga, MFernández-Sáez, NHerrera-Arozamena, CMorales-García, JAAlonso-Gil, SPérez-Castillo, ACaignard, DHRivara, SRodríguez-Franco, MI Novel N-Acetyl Bioisosteres of Melatonin: Melatonergic Receptor Pharmacology, Physicochemical Studies, and Phenotypic Assessment of Their Neurogenic Potential. J Med Chem58:4998-5014 (2015) 
 
Melatonin receptor type 1A
Name:Melatonin receptor type 1A
Type:Enzyme
Mol. Mass.:39392.94
Organism:Homo sapiens (Human)
Description:P48039
Residue:350
BDBM50097065
NameBDBM50097065
Synonyms:CHEMBL3580914
TypeSmall organic molecule
Emp. Form.C14H15N3O2
Mol. Mass.257.2878
SMILESCOc1ccc2[nH]cc(CCc3nc(C)no3)c2c1