Reaction Details
TargetCytochrome P450 3A4
LigandBDBM50097151
Substrate/Competitorn/a
Meas. Tech.ChEMBL_1499751 (CHEMBL3585200)
IC50 7500±n/a nM
Citation Green, JCao, JBandarage, UKGao, HCourt, JMarhefka, CJacobs, MTaslimi, PNewsome, DNakayama, TShah, SRodems, S Design, Synthesis, and Structure-Activity Relationships of Pyridine-Based Rho Kinase (ROCK) Inhibitors. J Med Chem58:5028-37 (2015) 
 
Cytochrome P450 3A4
Name:Cytochrome P450 3A4
Type:Enzyme
Mol. Mass.:57349.57
Organism:Homo sapiens (Human)
Description:n/a
Residue:503
BDBM50097151
NameBDBM50097151
Synonyms:CHEMBL3581148
TypeSmall organic molecule
Emp. Form.C18H16ClN3O3S2
Mol. Mass.421.921
SMILESCS(=O)(=O)Nc1cccc(CC(=O)Nc2cc(cs2)-c2ccnc(Cl)c2)c1