Reaction Details
TargetCytochrome P450 1A2
LigandBDBM50097166
Substrate/Competitorn/a
Meas. Tech.ChEMBL_1499752 (CHEMBL3585201)
IC50>100000±n/a nM
Citation Green, JCao, JBandarage, UKGao, HCourt, JMarhefka, CJacobs, MTaslimi, PNewsome, DNakayama, TShah, SRodems, S Design, Synthesis, and Structure-Activity Relationships of Pyridine-Based Rho Kinase (ROCK) Inhibitors. J Med Chem58:5028-37 (2015) 
 
Cytochrome P450 1A2
Name:Cytochrome P450 1A2
Type:Enzyme
Mol. Mass.:58423.38
Organism:Homo sapiens (Human)
Description:P05177
Residue:516
BDBM50097166
NameBDBM50097166
Synonyms:CHEMBL3580669
TypeSmall organic molecule
Emp. Form.C18H16FN3O3S2
Mol. Mass.405.466
SMILESCS(=O)(=O)Nc1cccc(CC(=O)Nc2cc(cs2)-c2ccnc(F)c2)c1