Reaction Details
TargetRho-associated protein kinase 1
LigandBDBM50027431
Substrate/Competitorn/a
Meas. Tech.ChEMBL_1499769 (CHEMBL3585218)
Ki 150±n/a nM
Citation Green, JCao, JBandarage, UKGao, HCourt, JMarhefka, CJacobs, MTaslimi, PNewsome, DNakayama, TShah, SRodems, S Design, Synthesis, and Structure-Activity Relationships of Pyridine-Based Rho Kinase (ROCK) Inhibitors. J Med Chem58:5028-37 (2015) 
 
Rho-associated protein kinase 1
Name:Rho-associated protein kinase 1
Type:Serine/threonine-protein kinase
Mol. Mass.:158156.77
Organism:Homo sapiens (Human)
Description:Q13464
Residue:1354
BDBM50027431
NameBDBM50027431
Synonyms:HYDROXYFASUDIL | Hydroxy-Fasudil
TypeSmall organic molecule
Emp. Form.C14H17N3O3S
Mol. Mass.307.368
SMILESOc1nccc2c(cccc12)S(=O)(=O)N1CCCNCC1