Reaction Details
TargetcAMP-dependent protein kinase catalytic subunit alpha
LigandBDBM50097164
Substrate/Competitorn/a
Meas. Tech.ChEMBL_1499749 (CHEMBL3585198)
Ki>3300±n/a nM
Citation Green, JCao, JBandarage, UKGao, HCourt, JMarhefka, CJacobs, MTaslimi, PNewsome, DNakayama, TShah, SRodems, S Design, Synthesis, and Structure-Activity Relationships of Pyridine-Based Rho Kinase (ROCK) Inhibitors. J Med Chem58:5028-37 (2015) 
 
cAMP-dependent protein kinase catalytic subunit alpha
Name:cAMP-dependent protein kinase catalytic subunit alpha
Type:Enzyme Catalytic Subunit
Mol. Mass.:40598.73
Organism:Homo sapiens (Human)
Description:n/a
Residue:351
BDBM50097164
NameBDBM50097164
Synonyms:CHEMBL3581145
TypeSmall organic molecule
Emp. Form.C17H14ClN3O2S
Mol. Mass.359.83
SMILESCOc1cccc(CC(=O)Nc2nc(cs2)-c2ccnc(Cl)c2)c1