Reaction Details
TargetcAMP-dependent protein kinase catalytic subunit alpha
LigandBDBM50097166
Substrate/Competitorn/a
Meas. Tech.ChEMBL_1499749 (CHEMBL3585198)
Ki 3000±n/a nM
Citation Green, JCao, JBandarage, UKGao, HCourt, JMarhefka, CJacobs, MTaslimi, PNewsome, DNakayama, TShah, SRodems, S Design, Synthesis, and Structure-Activity Relationships of Pyridine-Based Rho Kinase (ROCK) Inhibitors. J Med Chem58:5028-37 (2015) 
 
cAMP-dependent protein kinase catalytic subunit alpha
Name:cAMP-dependent protein kinase catalytic subunit alpha
Type:Enzyme Catalytic Subunit
Mol. Mass.:40598.73
Organism:Homo sapiens (Human)
Description:n/a
Residue:351
BDBM50097166
NameBDBM50097166
Synonyms:CHEMBL3580669
TypeSmall organic molecule
Emp. Form.C18H16FN3O3S2
Mol. Mass.405.466
SMILESCS(=O)(=O)Nc1cccc(CC(=O)Nc2cc(cs2)-c2ccnc(F)c2)c1