Reaction Details
TargetRho-associated protein kinase 1
LigandBDBM50097170
Substrate/Competitorn/a
Meas. Tech.ChEMBL_1499748 (CHEMBL3585197)
Ki 140±n/a nM
Citation Green, JCao, JBandarage, UKGao, HCourt, JMarhefka, CJacobs, MTaslimi, PNewsome, DNakayama, TShah, SRodems, S Design, Synthesis, and Structure-Activity Relationships of Pyridine-Based Rho Kinase (ROCK) Inhibitors. J Med Chem58:5028-37 (2015) 
 
Rho-associated protein kinase 1
Name:Rho-associated protein kinase 1
Type:Serine/threonine-protein kinase
Mol. Mass.:158156.77
Organism:Homo sapiens (Human)
Description:Q13464
Residue:1354
BDBM50097170
NameBDBM50097170
Synonyms:CHEMBL3581134
TypeSmall organic molecule
Emp. Form.C18H16N2O2S
Mol. Mass.324.397
SMILESCOc1cccc(CC(=O)Nc2ccc(s2)-c2ccncc2)c1