Reaction Details
TargetRho-associated protein kinase 1
LigandBDBM50097177
Substrate/Competitorn/a
Meas. Tech.ChEMBL_1499748 (CHEMBL3585197)
Ki 7.0±n/a nM
Citation Green, JCao, JBandarage, UKGao, HCourt, JMarhefka, CJacobs, MTaslimi, PNewsome, DNakayama, TShah, SRodems, S Design, Synthesis, and Structure-Activity Relationships of Pyridine-Based Rho Kinase (ROCK) Inhibitors. J Med Chem58:5028-37 (2015) 
 
Rho-associated protein kinase 1
Name:Rho-associated protein kinase 1
Type:Serine/threonine-protein kinase
Mol. Mass.:158156.77
Organism:Homo sapiens (Human)
Description:Q13464
Residue:1354
BDBM50097177
NameBDBM50097177
Synonyms:CHEMBL3581126
TypeSmall organic molecule
Emp. Form.C17H12ClN3O3S
Mol. Mass.373.813
SMILESClc1c2OCOc2ccc1CC(=O)Nc1nc(cs1)-c1ccncc1