Reaction Details
TargetcAMP-dependent protein kinase catalytic subunit alpha
LigandBDBM50097169
Substrate/Competitorn/a
Meas. Tech.ChEMBL_1499749 (CHEMBL3585198)
Ki 500±n/a nM
Citation Green, JCao, JBandarage, UKGao, HCourt, JMarhefka, CJacobs, MTaslimi, PNewsome, DNakayama, TShah, SRodems, S Design, Synthesis, and Structure-Activity Relationships of Pyridine-Based Rho Kinase (ROCK) Inhibitors. J Med Chem58:5028-37 (2015) 
 
cAMP-dependent protein kinase catalytic subunit alpha
Name:cAMP-dependent protein kinase catalytic subunit alpha
Type:Enzyme Catalytic Subunit
Mol. Mass.:40598.73
Organism:Homo sapiens (Human)
Description:n/a
Residue:351
BDBM50097169
NameBDBM50097169
Synonyms:CHEMBL3581135
TypeSmall organic molecule
Emp. Form.C16H14N4O2S
Mol. Mass.326.373
SMILESCOc1cccc(CC(=O)Nc2nc(ns2)-c2ccncc2)c1