Reaction Details
TargetcAMP-dependent protein kinase catalytic subunit alpha
LigandBDBM50097352
Substrate/Competitorn/a
Meas. Tech.ChEMBL_1499749 (CHEMBL3585198)
Ki>5000±n/a nM
Citation Green, JCao, JBandarage, UKGao, HCourt, JMarhefka, CJacobs, MTaslimi, PNewsome, DNakayama, TShah, SRodems, S Design, Synthesis, and Structure-Activity Relationships of Pyridine-Based Rho Kinase (ROCK) Inhibitors. J Med Chem58:5028-37 (2015) 
 
cAMP-dependent protein kinase catalytic subunit alpha
Name:cAMP-dependent protein kinase catalytic subunit alpha
Type:Enzyme Catalytic Subunit
Mol. Mass.:40598.73
Organism:Homo sapiens (Human)
Description:n/a
Residue:351
BDBM50097352
NameBDBM50097352
Synonyms:CHEMBL3581122
TypeSmall organic molecule
Emp. Form.C16H13N3O2S
Mol. Mass.311.358
SMILESOc1ccccc1CC(=O)Nc1nc(cs1)-c1ccncc1