Reaction Details
TargetcAMP-dependent protein kinase catalytic subunit alpha
LigandBDBM50097359
Substrate/Competitorn/a
Meas. Tech.ChEMBL_1499749 (CHEMBL3585198)
Ki>5000±n/a nM
Citation Green, JCao, JBandarage, UKGao, HCourt, JMarhefka, CJacobs, MTaslimi, PNewsome, DNakayama, TShah, SRodems, S Design, Synthesis, and Structure-Activity Relationships of Pyridine-Based Rho Kinase (ROCK) Inhibitors. J Med Chem58:5028-37 (2015) 
 
cAMP-dependent protein kinase catalytic subunit alpha
Name:cAMP-dependent protein kinase catalytic subunit alpha
Type:Enzyme Catalytic Subunit
Mol. Mass.:40598.73
Organism:Homo sapiens (Human)
Description:n/a
Residue:351
BDBM50097359
NameBDBM50097359
Synonyms:CHEMBL3581115
TypeSmall organic molecule
Emp. Form.C15H10FN3OS
Mol. Mass.299.323
SMILESFc1ccccc1C(=O)Nc1nc(cs1)-c1ccncc1