Reaction Details
TargetRho-associated protein kinase 1
LigandBDBM50097161
Substrate/Competitorn/a
Meas. Tech.ChEMBL_1499748 (CHEMBL3585197)
Ki>2500±n/a nM
Citation Green, JCao, JBandarage, UKGao, HCourt, JMarhefka, CJacobs, MTaslimi, PNewsome, DNakayama, TShah, SRodems, S Design, Synthesis, and Structure-Activity Relationships of Pyridine-Based Rho Kinase (ROCK) Inhibitors. J Med Chem58:5028-37 (2015) 
 
Rho-associated protein kinase 1
Name:Rho-associated protein kinase 1
Type:Serine/threonine-protein kinase
Mol. Mass.:158156.77
Organism:Homo sapiens (Human)
Description:Q13464
Residue:1354
BDBM50097161
NameBDBM50097161
Synonyms:CHEMBL3581142
TypeSmall organic molecule
Emp. Form.C19H20N4O2S
Mol. Mass.368.453
SMILESCOc1cccc(CC(=O)Nc2nc(cs2)-c2ccnc(c2)N(C)C)c1