Reaction Details
TargetcAMP-specific 3',5'-cyclic phosphodiesterase 4D
LigandBDBM50097485
Substrate/Competitorn/a
Meas. Tech.ChEMBL_1501584 (CHEMBL3587234)
IC50 190±n/a nM
Citation Brullo, CMassa, MVilla, CRicciarelli, RRivera, DPronzato, MAFedele, EBarocelli, EBertoni, SFlammini, LBruno, O Synthesis, biological activities and pharmacokinetic properties of new fluorinated derivatives of selective PDE4D inhibitors. Bioorg Med Chem23:3426-35 (2015) 
 
cAMP-specific 3',5'-cyclic phosphodiesterase 4D
Name:cAMP-specific 3',5'-cyclic phosphodiesterase 4D
Type:Protein
Mol. Mass.:91092.69
Organism:Homo sapiens (Human)
Description:Q08499
Residue:809
BDBM50097485
NameBDBM50097485
Synonyms:CHEMBL3585872
TypeSmall organic molecule
Emp. Form.C22H33F2N3O5
Mol. Mass.457.5113
SMILESCC1CN(CC(C)O1)NCC(O)CO\N=C\c1ccc(OC(F)F)c(OC2CCCC2)c1