Reaction Details
TargetVascular endothelial growth factor receptor 2
LigandBDBM50097514
Substrate/Competitorn/a
Meas. Tech.ChEMBL_1500453 (CHEMBL3587278)
IC50 0.220000±n/a nM
Citation Su, PWang, JShi, YPan, XShao, RZhang, J Discovery of biphenyl-aryl ureas as novel VEGFR-2 inhibitors. Part 4: exploration of diverse hinge-binding fragments. Bioorg Med Chem23:3228-36 (2015) 
 
Vascular endothelial growth factor receptor 2
Name:Vascular endothelial growth factor receptor 2
Type:Receptor Tyrosine Kinase
Mol. Mass.:151510.97
Organism:Homo sapiens (Human)
Description:P35968
Residue:1356
BDBM50097514
NameBDBM50097514
Synonyms:CHEMBL3586057
TypeSmall organic molecule
Emp. Form.C20H13F6N3O
Mol. Mass.425.3271
SMILESFC(F)(F)c1cc(NC(=O)Nc2ccc(cc2)-c2cccnc2)cc(c1)C(F)(F)F