Reaction Details
TargetVascular endothelial growth factor receptor 2
LigandBDBM50097523
Substrate/Competitorn/a
Meas. Tech.ChEMBL_1500453 (CHEMBL3587278)
IC50 0.150000±n/a nM
Citation Su, PWang, JShi, YPan, XShao, RZhang, J Discovery of biphenyl-aryl ureas as novel VEGFR-2 inhibitors. Part 4: exploration of diverse hinge-binding fragments. Bioorg Med Chem23:3228-36 (2015) 
 
Vascular endothelial growth factor receptor 2
Name:Vascular endothelial growth factor receptor 2
Type:Receptor Tyrosine Kinase
Mol. Mass.:151510.97
Organism:Homo sapiens (Human)
Description:P35968
Residue:1356
BDBM50097523
NameBDBM50097523
Synonyms:CHEMBL3586071
TypeSmall organic molecule
Emp. Form.C21H16ClF3N4O2
Mol. Mass.448.826
SMILESCNC(=O)c1cc(ccn1)-c1ccc(NC(=O)Nc2ccc(Cl)c(c2)C(F)(F)F)cc1