Reaction Details
Target5-hydroxytryptamine receptor 2C
LigandBDBM50097691
Substrate/Competitorn/a
Meas. Tech.ChEMBL_1504496 (CHEMBL3590938)
Temperature298.15±n/a K
EC50 15488±n/a nM
Commentsextracted
Citation Hansen, MJacobsen, SEPlunkett, SLiebscher, GEMcCorvy, JDBräuner-Osborne, HKristensen, JL Synthesis and pharmacological evaluation of N-benzyl substituted 4-bromo-2,5-dimethoxyphenethylamines as 5-HT2A/2C partial agonists. Bioorg Med Chem23:3933-7 (2015) 
 
5-hydroxytryptamine receptor 2C
Name:5-hydroxytryptamine receptor 2C
Type:G Protein-Coupled Receptor (GPCR)
Mol. Mass.:51836.79
Organism:Homo sapiens (Human)
Description:P28335
Residue:458
BDBM50097691
NameBDBM50097691
Synonyms:CHEMBL3589596
TypeSmall organic molecule
Emp. Form.C18H22BrNO4
Mol. Mass.396.276
SMILESCOc1cccc(CNCCc2cc(OC)c(Br)cc2OC)c1O