Reaction Details
TargetAlpha-2C adrenergic receptor
LigandBDBM50106345
Substrate/Competitorn/a
Meas. Tech.ChEMBL_1504524 (CHEMBL3591120)
EC50<501187±n/a nM
Citation Szollosi, EBobok, AKiss, LVass, MKurkó, DKolok, SVisegrády, AKeseru, GM Cell-based and virtual fragment screening for adrenergica2C receptor agonists. Bioorg Med Chem23:3991-9 (2015) 
 
Alpha-2C adrenergic receptor
Name:Alpha-2C adrenergic receptor
Type:Enzyme
Mol. Mass.:49552.32
Organism:Homo sapiens (Human)
Description:P18825
Residue:462
BDBM50106345
NameBDBM50106345
Synonyms:4-(4-Methyl-piperazin-1-yl)-phenylamine cid_737253
TypeSmall organic molecule
Emp. Form.C11H17N3
Mol. Mass.191.2728
SMILESCN1CCN(CC1)c1ccc(N)cc1