Reaction Details
TargetD(3) dopamine receptor
LigandBDBM50097837
Substrate/Competitorn/a
Meas. Tech.ChEMBL_1504529 (CHEMBL3591125)
Ki 3.1±n/a nM
Citation Keck, TMBanala, AKSlack, RDBurzynski, CBonifazi, AOkunola-Bakare, OMMoore, MDeschamps, JRRais, RSlusher, BSNewman, AH Using click chemistry toward novel 1,2,3-triazole-linked dopamine D3 receptor ligands. Bioorg Med Chem23:4000-12 (2015) 
 
D(3) dopamine receptor
Name:D(3) dopamine receptor
Type:n/a
Mol. Mass.:44243.43
Organism:Homo sapiens (Human)
Description:n/a
Residue:400
BDBM50097837
NameBDBM50097837
Synonyms:CHEMBL3588915
TypeSmall organic molecule
Emp. Form.C25H30N6O
Mol. Mass.430.5453
SMILESCOc1ccccc1N1CCN(CCCCc2cn(nn2)-c2ccc3[nH]ccc3c2)CC1