Reaction Details
TargetDual specificity protein kinase CLK2
LigandBDBM50097860
Substrate/Competitorn/a
Meas. Tech.ChEMBL_1502246 (CHEMBL3591182)
IC50 1300±n/a nM
Citation Falke, HChaikuad, ABecker, ALoaëc, NLozach, OAbu Jhaisha, SBecker, WJones, PGPreu, LBaumann, KKnapp, SMeijer, LKunick, C 10-iodo-11H-indolo[3,2-c]quinoline-6-carboxylic acids are selective inhibitors of DYRK1A. J Med Chem58:3131-43 (2015) 
 
Dual specificity protein kinase CLK2
Name:Dual specificity protein kinase CLK2
Type:PROTEIN
Mol. Mass.:60021.57
Organism:Mus musculus
Description:ChEMBL_1502246
Residue:499
BDBM50097860
NameBDBM50097860
Synonyms:CHEMBL3589671
TypeSmall organic molecule
Emp. Form.C16H8ClIN2O2
Mol. Mass.422.604
SMILESOC(=O)c1nc2ccc(I)cc2c2[nH]c3c(Cl)cccc3c12