Reaction Details
TargetDual specificity tyrosine-phosphorylation-regulated kinase 1B
LigandBDBM50097855
Substrate/Competitorn/a
Meas. Tech.ChEMBL_1502249 (CHEMBL3591328)
IC50 230±n/a nM
Citation Falke, HChaikuad, ABecker, ALoaëc, NLozach, OAbu Jhaisha, SBecker, WJones, PGPreu, LBaumann, KKnapp, SMeijer, LKunick, C 10-iodo-11H-indolo[3,2-c]quinoline-6-carboxylic acids are selective inhibitors of DYRK1A. J Med Chem58:3131-43 (2015) 
 
Dual specificity tyrosine-phosphorylation-regulated kinase 1B
Name:Dual specificity tyrosine-phosphorylation-regulated kinase 1B
Type:Enzyme
Mol. Mass.:69222.24
Organism:Homo sapiens (Human)
Description:Q9Y463
Residue:629
BDBM50097855
NameBDBM50097855
Synonyms:CHEMBL3589666
TypeSmall organic molecule
Emp. Form.C17H11BrN2O3
Mol. Mass.371.185
SMILESCOc1ccc2c3[nH]c4c(Br)cccc4c3c(nc2c1)C(O)=O