Reaction Details
TargetCyclin-dependent kinase 9
LigandBDBM50097855
Substrate/Competitorn/a
Meas. Tech.ChEMBL_1502244 (CHEMBL3591180)
IC50 1500±n/a nM
Citation Falke, HChaikuad, ABecker, ALoaëc, NLozach, OAbu Jhaisha, SBecker, WJones, PGPreu, LBaumann, KKnapp, SMeijer, LKunick, C 10-iodo-11H-indolo[3,2-c]quinoline-6-carboxylic acids are selective inhibitors of DYRK1A. J Med Chem58:3131-43 (2015) 
 
Cyclin-dependent kinase 9
Name:Cyclin-dependent kinase 9
Type:Enzyme Subunit
Mol. Mass.:42789.13
Organism:Homo sapiens (Human)
Description:n/a
Residue:372
BDBM50097855
NameBDBM50097855
Synonyms:CHEMBL3589666
TypeSmall organic molecule
Emp. Form.C17H11BrN2O3
Mol. Mass.371.185
SMILESCOc1ccc2c3[nH]c4c(Br)cccc4c3c(nc2c1)C(O)=O