Reaction Details
TargetCyclin-dependent kinase 5
LigandBDBM50097878
Substrate/Competitorn/a
Meas. Tech.ChEMBL_1502239 (CHEMBL3591175)
IC50>10000±n/a nM
Citation Falke, HChaikuad, ABecker, ALoaëc, NLozach, OAbu Jhaisha, SBecker, WJones, PGPreu, LBaumann, KKnapp, SMeijer, LKunick, C 10-iodo-11H-indolo[3,2-c]quinoline-6-carboxylic acids are selective inhibitors of DYRK1A. J Med Chem58:3131-43 (2015) 
 
Cyclin-dependent kinase 5
Name:Cyclin-dependent kinase 5
Type:Enzyme Subunit
Mol. Mass.:33308.61
Organism:Homo sapiens (Human)
Description:n/a
Residue:292
BDBM50097878
NameBDBM50097878
Synonyms:CHEMBL3589658
TypeSmall organic molecule
Emp. Form.C17H10N2O4
Mol. Mass.306.2723
SMILESOC(=O)c1ccc2[nH]c3c(c(nc4ccccc34)C(O)=O)c2c1