Reaction Details
TargetDual specificity tyrosine-phosphorylation-regulated kinase 1A
LigandBDBM50097864
Substrate/Competitorn/a
Meas. Tech.ChEMBL_1502241 (CHEMBL3591177)
IC50 56±n/a nM
Citation Falke, HChaikuad, ABecker, ALoaëc, NLozach, OAbu Jhaisha, SBecker, WJones, PGPreu, LBaumann, KKnapp, SMeijer, LKunick, C 10-iodo-11H-indolo[3,2-c]quinoline-6-carboxylic acids are selective inhibitors of DYRK1A. J Med Chem58:3131-43 (2015) 
 
Dual specificity tyrosine-phosphorylation-regulated kinase 1A
Name:Dual specificity tyrosine-phosphorylation-regulated kinase 1A
Type:Enzyme
Mol. Mass.:85616.61
Organism:Homo sapiens (Human)
Description:Q13627
Residue:763
BDBM50097864
NameBDBM50097864
Synonyms:CHEMBL3589675
TypeSmall organic molecule
Emp. Form.C23H15ClN2O3
Mol. Mass.402.83
SMILESCOc1ccc(cc1)-c1ccc2nc(C(O)=O)c3c4cccc(Cl)c4[nH]c3c2c1