Reaction Details
TargetMitogen-activated protein kinase 1
LigandBDBM50097875
Substrate/Competitorn/a
Meas. Tech.ChEMBL_1502243 (CHEMBL3591179)
IC50>10000±n/a nM
Citation Falke, HChaikuad, ABecker, ALoaëc, NLozach, OAbu Jhaisha, SBecker, WJones, PGPreu, LBaumann, KKnapp, SMeijer, LKunick, C 10-iodo-11H-indolo[3,2-c]quinoline-6-carboxylic acids are selective inhibitors of DYRK1A. J Med Chem58:3131-43 (2015) 
 
Mitogen-activated protein kinase 1
Name:Mitogen-activated protein kinase 1
Type:Ser/Thr Protein Kinase
Mol. Mass.:41392.76
Organism:Homo sapiens (Human)
Description:P28482
Residue:360
BDBM50097875
NameBDBM50097875
Synonyms:CHEMBL3589655
TypeSmall organic molecule
Emp. Form.C17H9F3N2O2
Mol. Mass.330.2608
SMILESOC(=O)c1nc2ccccc2c2[nH]c3ccc(cc3c12)C(F)(F)F