Reaction Details
TargetCarbonic anhydrase 1
LigandBDBM50098360
Substrate/Competitorn/a
Meas. Tech.ChEMBL_1505005 (CHEMBL3595787)
Ki 49±n/a nM
Citation Ibrahim, DALasheen, DSZaky, MYIbrahim, AWVullo, DCeruso, MSupuran, CTAbou El Ella, DA Design and synthesis of benzothiazole-6-sulfonamides acting as highly potent inhibitors of carbonic anhydrase isoforms I, II, IX and XII. Bioorg Med Chem23:4989-99 (2015) 
 
Carbonic anhydrase 1
Name:Carbonic anhydrase 1
Type:Enzyme
Mol. Mass.:28873.37
Organism:Homo sapiens (Human)
Description:P00915
Residue:261
BDBM50098360
NameBDBM50098360
Synonyms:CHEMBL3594413
TypeSmall organic molecule
Emp. Form.C14H12N8O3S2
Mol. Mass.404.427
SMILESNc1ncnc2n(CC(=O)Nc3nc4ccc(cc4s3)S(N)(=O)=O)ncc12