Reaction Details
TargetCarbonic anhydrase 1
LigandBDBM50098365
Substrate/Competitorn/a
Meas. Tech.ChEMBL_1505005 (CHEMBL3595787)
Ki 222±n/a nM
Citation Ibrahim, DALasheen, DSZaky, MYIbrahim, AWVullo, DCeruso, MSupuran, CTAbou El Ella, DA Design and synthesis of benzothiazole-6-sulfonamides acting as highly potent inhibitors of carbonic anhydrase isoforms I, II, IX and XII. Bioorg Med Chem23:4989-99 (2015) 
 
Carbonic anhydrase 1
Name:Carbonic anhydrase 1
Type:Enzyme
Mol. Mass.:28873.37
Organism:Homo sapiens (Human)
Description:P00915
Residue:261
BDBM50098365
NameBDBM50098365
Synonyms:CHEMBL3594408
TypeSmall organic molecule
Emp. Form.C19H18ClN7O4S3
Mol. Mass.540.039
SMILESCc1ccc(OCc2nnc(SCC(=O)Nc3nc4ccc(cc4s3)S(N)(=O)=O)n2N)cc1Cl