Reaction Details
TargetCarbonic anhydrase 2
LigandBDBM50098368
Substrate/Competitorn/a
Meas. Tech.ChEMBL_1505006 (CHEMBL3595788)
Ki 9.6±n/a nM
Citation Ibrahim, DALasheen, DSZaky, MYIbrahim, AWVullo, DCeruso, MSupuran, CTAbou El Ella, DA Design and synthesis of benzothiazole-6-sulfonamides acting as highly potent inhibitors of carbonic anhydrase isoforms I, II, IX and XII. Bioorg Med Chem23:4989-99 (2015) 
 
Carbonic anhydrase 2
Name:Carbonic anhydrase 2
Type:Enzyme
Mol. Mass.:29250.71
Organism:Homo sapiens (Human)
Description:P00918
Residue:260
BDBM50098368
NameBDBM50098368
Synonyms:CHEMBL3594404
TypeSmall organic molecule
Emp. Form.C13H12N6O4S3
Mol. Mass.412.467
SMILESNc1cc(=O)[nH]c(SCC(=O)Nc2nc3ccc(cc3s2)S(N)(=O)=O)n1