Reaction Details
TargetCarbonic anhydrase 2
LigandBDBM50098353
Substrate/Competitorn/a
Meas. Tech.ChEMBL_1505006 (CHEMBL3595788)
Ki 3.5±n/a nM
Citation Ibrahim, DALasheen, DSZaky, MYIbrahim, AWVullo, DCeruso, MSupuran, CTAbou El Ella, DA Design and synthesis of benzothiazole-6-sulfonamides acting as highly potent inhibitors of carbonic anhydrase isoforms I, II, IX and XII. Bioorg Med Chem23:4989-99 (2015) 
 
Carbonic anhydrase 2
Name:Carbonic anhydrase 2
Type:Enzyme
Mol. Mass.:29250.71
Organism:Homo sapiens (Human)
Description:P00918
Residue:260
BDBM50098353
NameBDBM50098353
Synonyms:CHEMBL3594419
TypeSmall organic molecule
Emp. Form.C18H18N8O4S6
Mol. Mass.602.777
SMILESNS(=O)(=O)c1ccc2nc(NC(=S)NCCNC(=S)Nc3nc4ccc(cc4s3)S(N)(=O)=O)sc2c1