Reaction Details
TargetCarbonic anhydrase 12
LigandBDBM50098367
Substrate/Competitorn/a
Meas. Tech.ChEMBL_1505008 (CHEMBL3595790)
Ki 8.3±n/a nM
Citation Ibrahim, DALasheen, DSZaky, MYIbrahim, AWVullo, DCeruso, MSupuran, CTAbou El Ella, DA Design and synthesis of benzothiazole-6-sulfonamides acting as highly potent inhibitors of carbonic anhydrase isoforms I, II, IX and XII. Bioorg Med Chem23:4989-99 (2015) 
 
Carbonic anhydrase 12
Name:Carbonic anhydrase 12
Type:Enzyme
Mol. Mass.:39456.00
Organism:Homo sapiens (Human)
Description:Catalytic domain of human cloned isozyme was used in the assay
Residue:354
BDBM50098367
NameBDBM50098367
Synonyms:CHEMBL3594405
TypeSmall organic molecule
Emp. Form.C13H11N5O5S3
Mol. Mass.413.452
SMILESNS(=O)(=O)c1ccc2nc(NC(=O)CSc3nc(O)cc(=O)[nH]3)sc2c1