Reaction Details
TargetCarbonic anhydrase 12
LigandBDBM50098365
Substrate/Competitorn/a
Meas. Tech.ChEMBL_1505008 (CHEMBL3595790)
Ki 8.2±n/a nM
Citation Ibrahim, DALasheen, DSZaky, MYIbrahim, AWVullo, DCeruso, MSupuran, CTAbou El Ella, DA Design and synthesis of benzothiazole-6-sulfonamides acting as highly potent inhibitors of carbonic anhydrase isoforms I, II, IX and XII. Bioorg Med Chem23:4989-99 (2015) 
 
Carbonic anhydrase 12
Name:Carbonic anhydrase 12
Type:Enzyme
Mol. Mass.:39456.00
Organism:Homo sapiens (Human)
Description:Catalytic domain of human cloned isozyme was used in the assay
Residue:354
BDBM50098365
NameBDBM50098365
Synonyms:CHEMBL3594408
TypeSmall organic molecule
Emp. Form.C19H18ClN7O4S3
Mol. Mass.540.039
SMILESCc1ccc(OCc2nnc(SCC(=O)Nc3nc4ccc(cc4s3)S(N)(=O)=O)n2N)cc1Cl