Reaction Details
TargetCarbonic anhydrase 12
LigandBDBM50098353
Substrate/Competitorn/a
Meas. Tech.ChEMBL_1505008 (CHEMBL3595790)
Ki 4.8±n/a nM
Citation Ibrahim, DALasheen, DSZaky, MYIbrahim, AWVullo, DCeruso, MSupuran, CTAbou El Ella, DA Design and synthesis of benzothiazole-6-sulfonamides acting as highly potent inhibitors of carbonic anhydrase isoforms I, II, IX and XII. Bioorg Med Chem23:4989-99 (2015) 
 
Carbonic anhydrase 12
Name:Carbonic anhydrase 12
Type:Enzyme
Mol. Mass.:39456.00
Organism:Homo sapiens (Human)
Description:Catalytic domain of human cloned isozyme was used in the assay
Residue:354
BDBM50098353
NameBDBM50098353
Synonyms:CHEMBL3594419
TypeSmall organic molecule
Emp. Form.C18H18N8O4S6
Mol. Mass.602.777
SMILESNS(=O)(=O)c1ccc2nc(NC(=S)NCCNC(=S)Nc3nc4ccc(cc4s3)S(N)(=O)=O)sc2c1