Reaction Details
TargetKappa-type opioid receptor
LigandBDBM50101308
Substrate/Competitorn/a
Meas. Tech.ChEMBL_1454174 (CHEMBL3363204)
Ki>1000±n/a nM
Citation Hirayama, SWada, NNemoto, TIwai, TFujii, HNagase, H Synthesis and Pharmacology of a Novel¿ Opioid Receptor (KOR) Agonist with a 1,3,5-Trioxazatriquinane Skeleton. ACS Med Chem Lett5:868-72 (2014) 
 
Kappa-type opioid receptor
Name:Kappa-type opioid receptor
Type:G Protein-Coupled Receptor (GPCR)
Mol. Mass.:42744.99
Organism:Cavia porcellus (domestic guinea pig)
Description:P41144
Residue:380
BDBM50101308
NameBDBM50101308
Synonyms:CHEMBL3326361
TypeSmall organic molecule
Emp. Form.C21H23NO5
Mol. Mass.369.411
SMILES[H][C@]12CO[C@]3([H])N1[C@@]([H])(O[C@]3(C)c1cccc(O)c1)[C@@](C)(O2)c1cccc(OC)c1