Reaction Details
TargetKappa-type opioid receptor
LigandBDBM50101312
Substrate/Competitorn/a
Meas. Tech.ChEMBL_1454174 (CHEMBL3363204)
Ki>1000±n/a nM
Citation Hirayama, SWada, NNemoto, TIwai, TFujii, HNagase, H Synthesis and Pharmacology of a Novel¿ Opioid Receptor (KOR) Agonist with a 1,3,5-Trioxazatriquinane Skeleton. ACS Med Chem Lett5:868-72 (2014) 
 
Kappa-type opioid receptor
Name:Kappa-type opioid receptor
Type:G Protein-Coupled Receptor (GPCR)
Mol. Mass.:42744.99
Organism:Cavia porcellus (domestic guinea pig)
Description:P41144
Residue:380
BDBM50101312
NameBDBM50101312
Synonyms:CHEMBL3326357
TypeSmall organic molecule
Emp. Form.C13H15NO4
Mol. Mass.249.2625
SMILES[H][C@]12CO[C@]3([H])N1[C@]([H])(CO2)O[C@@]3(C)c1cccc(O)c1