Reaction Details
TargetKappa-type opioid receptor
LigandBDBM50000296
Substrate/Competitorn/a
Meas. Tech.ChEMBL_1454174 (CHEMBL3363204)
Ki 1.7±n/a nM
Citation Hirayama, SWada, NNemoto, TIwai, TFujii, HNagase, H Synthesis and Pharmacology of a Novel¿ Opioid Receptor (KOR) Agonist with a 1,3,5-Trioxazatriquinane Skeleton. ACS Med Chem Lett5:868-72 (2014) 
 
Kappa-type opioid receptor
Name:Kappa-type opioid receptor
Type:G Protein-Coupled Receptor (GPCR)
Mol. Mass.:42744.99
Organism:Cavia porcellus (domestic guinea pig)
Description:P41144
Residue:380
BDBM50000296
NameBDBM50000296
Synonyms:CHEMBL441765 U-50488H | US11492374, ID 1
TypeSmall organic molecule
Emp. Form.C19H26Cl2N2O
Mol. Mass.369.329
SMILESCN([C@@H]1CCCC[C@H]1N1CCCC1)C(=O)Cc1ccc(Cl)c(Cl)c1