Reaction Details
TargetHistone chaperone ASF1A
LigandBDBM50101667
Substrate/Competitorn/a
Meas. Tech.ChEMBL_1462421 (CHEMBL3395843)
IC50>100000±n/a nM
Citation Miknis, GFStevens, SJSmith, LEOstrov, DAChurchill, ME Development of novel Asf1-H3/H4 inhibitors. Bioorg Med Chem Lett25:963-8 (2015) 
 
Histone chaperone ASF1A
Name:Histone chaperone ASF1A
Type:PROTEIN
Mol. Mass.:22950.75
Organism:Homo sapiens (Human)
Description:ChEMBL_109562
Residue:204
BDBM50101667
NameBDBM50101667
Synonyms:CHEMBL3394924
TypeSmall organic molecule
Emp. Form.C22H20BrN3O4
Mol. Mass.470.316
SMILESCOc1cc(CNNC(=O)c2ccc(NC(=O)c3ccccc3)cc2)cc(Br)c1O