Reaction Details
TargetCarbonic anhydrase 2
LigandBDBM50344898
Substrate/Competitorn/a
Meas. Tech.ChEMBL_1446430 (CHEMBL3375544)
Ki 690000±n/a nM
Citation Vullo, DDel Prete, SOsman, SMScozzafava, AAlothman, ZSupuran, CTCapasso, C Anion inhibition study of the฿-class carbonic anhydrase (PgiCAb) from the oral pathogen Porphyromonas gingivalis. Bioorg Med Chem Lett24:4402-6 (2014) 
 
Carbonic anhydrase 2
Name:Carbonic anhydrase 2
Type:Enzyme
Mol. Mass.:29250.71
Organism:Homo sapiens (Human)
Description:P00918
Residue:260
BDBM50344898
NameBDBM50344898
Synonyms:CHEMBL1081267 | sodium perruthenate
TypeSmall organic molecule
Emp. Form.O4Ru
Mol. Mass.165.07
SMILESO=[Ru-](=O)(=O)=O