Reaction Details
TargetCarbonic anhydrase 2
LigandBDBM26985
Substrate/Competitorn/a
Meas. Tech.ChEMBL_1446430 (CHEMBL3375544)
Ki 1500000±n/a nM
Citation Vullo, DDel Prete, SOsman, SMScozzafava, AAlothman, ZSupuran, CTCapasso, C Anion inhibition study of the฿-class carbonic anhydrase (PgiCAb) from the oral pathogen Porphyromonas gingivalis. Bioorg Med Chem Lett24:4402-6 (2014) 
 
Carbonic anhydrase 2
Name:Carbonic anhydrase 2
Type:Enzyme
Mol. Mass.:29250.71
Organism:Homo sapiens (Human)
Description:P00918
Residue:260
BDBM26985
NameBDBM26985
Synonyms:2-triaza-1,2-diyne CHEMBL89295 azide
TypeIon
Emp. Form.N3
Mol. Mass.42.0206
SMILES[N-]=[N+]=[N-]