Reaction Details
TargetDelta-type opioid receptor
LigandBDBM50102827
Substrate/Competitorn/a
Meas. Tech.ChEMBL_1432428 (CHEMBL3385710)
Ki 3.8±n/a nM
Citation Watanabe, YKitazawa, SFujii, HNemoto, THirayama, SIwai, TGouda, HHirono, SNagasea, H Design, synthesis, and structure-activity relationship of novel opioid¿ receptor selective agonists:a-iminoamide derivatives with an azabicyclo[2.2.2]octene skeleton. Bioorg Med Chem Lett24:4980-3 (2014) 
 
Delta-type opioid receptor
Name:Delta-type opioid receptor
Type:Enzyme Catalytic Domain
Mol. Mass.:40577.25
Organism:MOUSE
Description:P32300
Residue:372
BDBM50102827
NameBDBM50102827
Synonyms:CHEMBL3339373
TypeSmall organic molecule
Emp. Form.C31H35N3O4
Mol. Mass.513.6273
SMILES[H][C@@]12CC(=O)N(Cc3ccccc3)CN1[C@]13CC[C@]2(O)C2Oc4c5c(CC1N(CC1CC1)CCC325)ccc4O